Grabbers/Traps/Collectors
type: Concept

GRAB SAMPLERS
in scheme: instruments
definition: GRAB SAMPLERS are a rapid collection of whole-air samples that are fitted into a suitable container, such as an n evacuated canister or polytetraflouroethylene (PTFE) bag.
type: Concept