ACADEMIC
type: Concept

BRIS/GEOGRAPHY
change note: 2022-04-08 08:32:58.0 [tstevens] insert AltLabel (id: null category: primary text: School of Geographical Sciences, University of Bristol language code: en); insert Definition (id: null text: Geography is an extraordinarily rich and diverse discipline that brings together the physical and human dimensions of our world, shedding light - through a unique combination of mathematicians, physical scientists, life scientists, social scientists and humanities scholars - on some of the most important challenges facing society. Bristol's School of Geographical Sciences is a major international centre for the development and delivery of geographical research and scholarship, the only Geography department in the country to come in the top category across every RAE that has been undertaken since 1986. Building on Bristol's long standing reputation for theoretical and methodological innovation, human geographers are moving into new areas such as geographies of knowledge and political economic geographies, and providing evidence for important policy impacts in finance, elections and health. Physical geographers lead research in Earth system science, producing new environmental data and novel numerical models for academic and applied contexts, and deploying expertise in evaluating models using large-scale datasets. language code: en); insert Resource (id: null type: provider url: https://research-information.bris.ac.uk/en/organisations/school-of-geographical-sciences);
change note: 2022-04-08 08:31:44.0 [tstevens] Insert Concept add broader relation (BRIS/GEOGRAPHY [99d01c58-aa71-4a56-83d8-b2df44d2a63c,879790] - ACADEMIC [7700280b-68ee-4644-bf5e-84e7a6adf897,865959]);
in scheme: providers
definition: Geography is an extraordinarily rich and diverse discipline that brings together the physical and human dimensions of our world, shedding light - through a unique combination of mathematicians, physical scientists, life scientists, social scientists and humanities scholars - on some of the most important challenges facing society. Bristol's School of Geographical Sciences is a major international centre for the development and delivery of geographical research and scholarship, the only Geography department in the country to come in the top category across every RAE that has been undertaken since 1986. Building on Bristol's long standing reputation for theoretical and methodological innovation, human geographers are moving into new areas such as geographies of knowledge and political economic geographies, and providing evidence for important policy impacts in finance, elections and health. Physical geographers lead research in Earth system science, producing new environmental data and novel numerical models for academic and applied contexts, and deploying expertise in evaluating models using large-scale datasets.
type: Concept