XRP
in scheme: instruments
definition: The x-ray polychromatic is intended for energy-time analysis of the x-ray radiation. The device operation is based on x-ray diffraction on a periodical crystal structure ? multilayer mirror. [Summary provided by the European Laboratory for Particle Physics]
type: Concept

X-Ray/Gamma Ray Detectors
type: Concept