G - I
type: Concept

Hydroclimatology
change note: 2013-11-20 13:31:03.0 [gee-cee] Insert Concept add broader relation (HC [9a0c4d32-54c1-450e-aafd-f086678ed176,105957] - G - I [af0968ce-ffe3-44a0-86de-2ec9b9a8fa5d,77509]);
change note: 2018-11-13 08:30:15.0 [tstevens] update PrefLabel (Hydroclimatology);
change note: 2017-06-07 10:34:50.0 [tstevens] update AltLabel (Hydroclimatology Collection);
change note: 2017-06-19 14:12:20.0 [sritz] update PrefLabel (hydroclimatology);
change note: 2013-11-20 13:33:47.0 [gee-cee] insert AltLabel (id: null text: Hydroclimatology Collections language code: en);
change note: 2017-06-14 12:15:46.0 [sritz] update PrefLabel (hydroclimatology collection); update Definition (The ORNL DAAC archives data on streamflow and climatology. The hydroclimatology data collection contains data relevant for the study of surface-water conditions, including the Global River Discharge Database (RivDIS v1.1).);
type: Concept
in scheme: projects
definition: The ORNL DAAC archives data on streamflow and climatology. The hydroclimatology data collection contains data relevant for the study of surface-water conditions, including the Global River Discharge Database (RivDIS v1.1).