NORWAY
type: Concept

NO/CRYOCLIM
in scheme: providers
definition: The vision of the CryoClim initiative is to develop new operational services for long-term systematic climate monitoring of the cryosphere. The project includes plans for development of services for sea ice and snow products of global coverage and glacier products covering Norway. The project is also aiming for an expansion where the glaciers in the Alps and the Greenland ice cap are included.
type: Concept