OR/CLIM
change note: 2020-07-31 15:11:40.0 [sritz] update Definition (The Oregon Climate Service (OCS), located on the Oregon State University campus in Corvallis, Oregon, is the state repository for weather and climate information. We are affiliated with OSU's College of Oceanic and Atmospheric Sciences (COAS). OCS's mission is fourfold: + To collect, manage and maintain Oregon weather and climate data. + To provide weather and climate information to those within and outside the state of Oregon. + To educate the people of Oregon on current and emerging climate issues. + To perform independent research related to weather and climate issues. http://ocs.oregonstate.edu/); update Resource (provider); update Resource (http://ocs.oregonstate.edu/);
in scheme: providers
definition: The Oregon Climate Service (OCS), located on the Oregon State University campus in Corvallis, Oregon, is the state repository for weather and climate information. We are affiliated with OSU's College of Oceanic and Atmospheric Sciences (COAS). OCS's mission is fourfold: + To collect, manage and maintain Oregon weather and climate data. + To provide weather and climate information to those within and outside the state of Oregon. + To educate the people of Oregon on current and emerging climate issues. + To perform independent research related to weather and climate issues. http://ocs.oregonstate.edu/
type: Concept

OREGON
type: Concept