MMIA
change note: 2021-10-26 16:46:50.0 [sritz] insert Definition (id: null text: ASIM uses optical observiations in carefully selected bands in order to filter out data with TLEs from the lightning data. Since downlink is limited, thse algorithms are implemented in the on-board software. The ASIM MMIA instrument is capable of observing 12 frames per second continuously in the 777.4 nm and 337 nm bands, both only 5 nm wide. Combined with 100 kHz photometer data from the same two bands in addition to a 180-230 nm band, data is filtered en realtime to optimize the available downlink capability allocated to ASIM on ISS. language code: en);
change note: 2021-10-26 16:45:18.0 [sritz] Insert Concept add broader relation (MMIA [9a7c9b6b-0188-440f-a9d0-6059d0c94863,778250] - Spectrometers [055a79c7-61db-4250-abad-f1e09909f14c,769377]);
change note: 2022-03-22 12:38:59.0 [sritz] insert WeightedRelation (id: null related concept uuid: f2b0301b-2f33-4048-9381-25a92226ed66 relationship type: null relationship value: null generated by: null);
change note: 2022-03-22 12:39:27.0 [sritz] update WeightedRelation (Platform-Instrument);
change note: 2021-10-26 16:46:07.0 [sritz] insert AltLabel (id: null category: primary text: Modular Multi-Imaging Assemble language code: en);
in scheme: instruments
definition: ASIM uses optical observiations in carefully selected bands in order to filter out data with TLEs from the lightning data. Since downlink is limited, thse algorithms are implemented in the on-board software. The ASIM MMIA instrument is capable of observing 12 frames per second continuously in the 777.4 nm and 337 nm bands, both only 5 nm wide. Combined with 100 kHz photometer data from the same two bands in addition to a 180-230 nm band, data is filtered en realtime to optimize the available downlink capability allocated to ASIM on ISS.
type: Concept

Spectrometers
type: Concept