ECHO SOUNDERS
change note: 2021-08-04 17:09:01.0 [sritz] insert AltLabel (id: null category: primary text: ECHO SOUNDERS language code: en);
in scheme: instruments
definition: ECHO SOUNDERS are devices that use sound waves to measure the depth of surface water bodies.
type: Concept

Acoustic Sounders
type: Concept