STREAM GAUGES
change note: 2021-08-05 17:36:14.0 [sritz] insert AltLabel (id: null category: primary text: STREAM GAUGES language code: en);
in scheme: instruments
definition: STREAM GAUGES are devices for measuring the river stage or level of the water surface in a river measured with reference to some datum; also called a river gauge.
type: Concept

Gauges
type: Concept