ANIMALS/INVERTEBRATES
type: Concept

PRIAPULANS
change note: 2017-03-13 14:18:41.0 [mgenazzi] Definition added insert Definition (id: null text: Phylum Priapulida. Commonly called Penis Worms are gonochoristic burrowing marine vermiform pseudocoelomate animals with spines around the mouth language code: en);
in scheme: sciencekeywords
definition: Phylum Priapulida. Commonly called Penis Worms are gonochoristic burrowing marine vermiform pseudocoelomate animals with spines around the mouth
type: Concept