NON-GOVERNMENT/NON-PROFIT ORGANIZATIONS
type: Concept

OL
in scheme: providers
definition: OceanLink is an online resource containing facts, news and a question/answer forum. There are also many links links divided into the following categories: marine, kids, teachers, and careers. Students can also find information pertaining to careers in marine biology or oceanography. There is a section called 'Ask a Marine Scientist' that allows users to as questions on marine science. Information provided by http://oceanlink.island.net/
type: Concept