GRACE-FO LRI
definition: First spaceborne laser interferometer to measure distance variations between remote spacecraft More Information: https://gracefo.jpl.nasa.gov
change note: 2019-09-09 16:01:32.0 [sritz] insert AltLabel (id: null category: primary text: GRACE-FO Laser Ranging Interferometer language code: en);
change note: 2019-09-09 16:02:42.0 [sritz] update Definition (First spaceborne laser interferometer to measure distance variations between remote spacecraft More Information: https://gracefo.jpl.nasa.gov); update Definition (https://gracefo.jpl.nasa.gov);
change note: 2019-09-09 16:03:54.0 [sritz] update WeightedRelation (Platform-Instrument); update WeightedRelation (1.0);
change note: 2019-09-09 16:00:53.0 [sritz] Insert Concept add broader relation (GRACE-FO LRI [9cf060b8-d8ea-46c4-a8de-f2073df5d0ae,369129] - Laser Ranging [a3ce2cfb-5488-4301-83c2-64bbc090c397,348161]);
change note: 2019-09-09 16:01:59.0 [sritz] insert Definition (id: null text: First spaceborne laser interferometer to measure distance variations between remote spacecraft language code: en);
change note: 2019-09-09 16:03:12.0 [sritz] insert WeightedRelation (id: null related concept uuid: f75e34e2-ebe7-4a6c-8bf6-da596a36b632 relationship type: null relationship value: null generated by: null);
type: Concept
in scheme: instruments

Laser Ranging
type: Concept