SAV/SEA GRASS BED
change note: 2016-06-13 13:42:27.0 [gee-cee] insert Definition (id: null text: Pertaining to areas of submerged aquatic vegetation or sea grasses below low-tide mark. language code: en);
change note: 2016-06-13 13:42:06.0 [gee-cee] Insert Concept add broader relation (SAV/SEA GRASS BED [9d0e3045-943e-460c-8bef-1db6fbf76341,188213] - COASTAL HABITAT [47be68db-d10d-43e7-b150-61cfd3f06126,84259]);
in scheme: sciencekeywords
definition: Pertaining to areas of submerged aquatic vegetation or sea grasses below low-tide mark.
type: Concept

COASTAL
type: Concept