VANGUARD
change note: 2021-11-30 09:43:27.0 [tstevens] Move Concepts delete broader relation (null); add broader relation (VANGUARD [9db79338-5030-45c2-9bf7-c81bfcefb9e1,826553] - Earth Observation Satellites [3466eed1-2fbb-49bf-ab0b-dc08731d502b,826121]);
change note: 2021-11-18 12:39:44.0 [tstevens] Move Concepts delete broader relation (null); add broader relation (VANGUARD [9db79338-5030-45c2-9bf7-c81bfcefb9e1,826553] - Space-based Platforms [b39a69b4-c3b9-4a94-b296-bbbbe5e4c847,835875]);
in scheme: platforms
definition: - Spacecraft Brief Description - Vanguard 2 was an earth-orbiting satellite designed to measure cloud-cover distribution over the daylight portion of its orbit. The spacecraft was a 9.8 kg magnesium sphere 50.8 cm in diameter. It contained two optical telescopes with two photocells. The sphere was internally gold-plated and externally covered with an aluminum deposit coated with silicon oxide of sufficient thickness to provide thermal control for the instrumentation. Radio communication was provided by a 1-W, 108.03-MHz telemetry transmitter and a 10-mW, 108-MHz beacon transmitter that sent a continuous signal for tracking purposes. A command receiver was used to activate a tape recorder that relayed telescope experiment data to the telemetry transmitter. Both transmitters functioned normally for 19 days. The satellite was spin stabilized at 50 rpm, but telemetry data were poor because of an unsatisfactory orientation of the spin axis. The power supply for the instrumentation was provided by mercury batteries. - Auxiliary Information - Launch Date and Time : 1959-02-17 16:05:00 Epoch Date and Time : 1959-02-17 16:48:00 Apogee (km or AU): 3320. Perigee (km or AU): 559. Inclination (degree) : 32.88 Orbit Type : Geocentric Information last updated on 1992-04-14 Vanguard 3 was launched by a Vanguard rocket from the Eastern Test Range into a geocentric orbit. The objectives of the flight were to measure the earth's magnetic field, the solar X-ray radiation and its effects on the earth's atmosphere, and the near-earth micrometeoroid environment. Instrumentation included a proton magnetometer, X-ray ionization chambers, and various micrometeoroid detectors. The spacecraft was a 50.8-cm-diameter magnesium sphere. The magnetometer was housed in a glass fiber phenolic resin conical tube attached to the sphere. Data transmission stopped on December 11, 1959, after 84 days of operation. The data obtained provided a comprehensive survey of the earth's magnetic field over the are…
type: Concept

Earth Observation Satellites
type: Concept