NON-GOVERNMENT/NON-PROFIT ORGANIZATIONS
type: Concept

CIESIN
in scheme: providers
definition: The Center for International Earth Science Information Network (CIESIN) is a center within the Earth Institute at Columbia University. CIESIN works at the intersection of the social, natural, and information sciences, and specializes in on-line data and information management, spatial data integration and training, and interdisciplinary research related to human interactions in the environment. Website: "http://www.ciesin.columbia.edu/" [Summary provided by CIESIN.]
type: Concept