SCRIPPS/IGPP/VC
in scheme: providers
definition: The Visualization Center at the Cecil and Ida Green Institute of Geophysics and Planetary Physics, Scripps Institution of Oceanography, University of California, San Diego is a state-of-the-art laboratory for the display, integration, analysis and exploration of various geophysical datasets supporting interdisciplinary research. It provides a diverse array of research tools supporting data sharing among distributed locations, live field reports, real-time data acquisition and presentation, real-time video teleconferencing and lectures. Its resources are also being applied to wider community needs, such as providing heightened response to natural disasters such as earthquakes, education, and outreach. Summary Provided By: http://siovizcenter.ucsd.edu/about.php
type: Concept

CONSORTIA/INSTITUTIONS
type: Concept