EPA
type: Concept

EPA/ORD/NHEERL/MED
change note: 2013-12-09 02:45:01.0 [sgrebas] insert AltLabel (id: null text: Mid-Continent Ecology Division, National Health and Environmental Effects Research Laboratory, Office of Research and Development, U.S. Environmental Protection Agency language code: en);
change note: 2013-12-09 02:43:56.0 [sgrebas] Insert Concept add broader relation (EPA/ORD/NHEERL/MED [9f58c79d-06e6-4552-aae7-8842822e0254,105985] - EPA [782baf09-4a51-4245-b913-40008bde17dd,66459]);
in scheme: providers
definition: The Mid-Continent Ecology Division is one of nine Divisions within EPA's National Health and Environmental Effects Research Laboratory. Five of the Divisions address human health effects and the remaining four, including our Division, are focused on the ecological effects of toxic chemicals, genetically modified organisms, nutrients, habitat alterations, and global climate change. Within this context, this Division is responsible for providing leadership in ecotoxicology and freshwater ecology by advancing scientifically-sound approaches for monitoring trends in ecological condition within the Great Lakes and Rivers, identifying impaired watersheds and diagnosing causes of degradation, and establishing risk-based assessments to support restoration and remediation decisions. The Division maintains research facilities in Duluth, Minnesota and Grosse Ile, Michigan. The Mid-Continent Ecology Division began in 1964 as the National Water Quality Laboratory under the U.S. Public Health Service and was soon transferred to the Federal Water Pollution Control Administration of the Department of the Interior. A 1970 reauthorization of the Federal Water Pollution Control Administration created the Environmental Protection Agency, of which the laboratory in Duluth became a part. In 1975, the laboratory and its station in Grosse Ile, MI, became part of EPA's Office of Research and Development and were re-named the Environmental Research Laboratory - Duluth. Finally, in 1995 the Laboratory was incorporated within the newly created National Health and Environmental Effects Research Laboratory as the Mid-Continent Ecology Division. Since the early days of its inception, the Division has been a leader in freshwater ecology and ecotoxicology. The Division is making great strides in advancing indicators and designs for monitoring ecosystem condition and diagnosing causes of impairment in large freshwater systems and watersheds. Development of mass-balance models for the Great Lakes, in…
type: Concept