SDI/P
in scheme: providers
definition: Pollen.com® has become the leading online resource for allergy sufferers, providing accurate, reliable, and timely information to help manage allergy conditions for millions of people. Pollen.comï¿½ prepares you for the day and provides a unique and proprietary four-day extended forecast, as well as individualized emails that include airborne allergen conditions in your local area. You can also get the pollen information for any zip code in the continental United States, simply by typing in the specific zip code or by clicking on the state map. This provides visitors with the ability to plan on when and where they can comfortably visit during that specific time of year. Since launching in January 2000, Pollen.comï¿½ has attracted over 1,200 web sites as affiliates who offer our allergy report as part of their content. Summary Provided By: http://www.surveillancedata.com/index.php?page_id=onl_pol
type: Concept

COMMERCIAL
type: Concept