CONSORTIA/INSTITUTIONS
type: Concept

GSA/ED
in scheme: providers
definition: The SEISMOLOGICAL SOCIETY OF AMERICA (SSA) is a scientific society devoted to the advancement of earthquake science. Founded in 1906 in San Francisco, the Society now has members throughout the world representing a variety of technical interests: seismologists and other geophysicists, geologists, engineers, insurers, and policy-makers in preparedness and safety. Summary Provided By: http://www.seismosoc.org/about/index.html
type: Concept