STATIC TEMPERATURE
change note: 2013-10-16 18:47:33.0 [saritz] updated definition update Definition (EOSDIS Parameter Keyword Definitions, https://earthdata.nasa.gov/about-eosdis);
change note: 2013-10-16 18:47:14.0 [saritz] updated definition update Definition (The temperature of undisturbed (static) air.); update Definition (EOSDOS Parameter Keyword Definitions, https://earthdata.nasa.gov/about-eosdis);
change note: 2013-09-04 14:37:17.0 [epneff] Move Concepts delete broader relation (null); add broader relation (STATIC TEMPERATURE [a1588b7d-7307-4543-9908-76d7877c4010,86647] - SURFACE TEMPERATURE [5a7bb095-4d12-4232-bc75-b8e82197cb92,86389]);
in scheme: sciencekeywords
definition: The temperature of undisturbed (static) air.
type: Concept

SURFACE TEMPERATURE
type: Concept