MULTINATIONAL ORGANIZATIONS
type: Concept

IGS/IFAG
in scheme: providers
definition: The Federal Agency for Cartography and Geodesy (BKG) in Frankfurt/Main, Germany operates a regional GPS/GLONASS data center. Observation data and analysis results from permanent GPS and GLONASS receivers are available through this server. The data center has an official function in the frameworks of the International GPS Service (IGS), the International GLONASS Service Pilot Project (IGLOS), the IAG Sub-Commission X for Europe (EUREF), and the German Geodetic GPS Reference Network (GREF). Website: "http://igs.ifag.de/"
type: Concept