NOAA-21
change note: 2023-05-24 15:32:59.0 [sritz] insert AltLabel (id: null category: primary text: Joint Polar Satellite System - 2 language code: en);
change note: 2023-05-24 15:31:35.0 [sritz] insert Definition (id: null text: NOAA’s Joint Polar Satellite System (JPSS) provides global observations that serve as the backbone of both short- and long-term forecasts, including those that help us predict and prepare for severe weather events. The five satellites scheduled in the fleet are the currently-flying NOAA/NASA Suomi National Polar-orbiting Partnership (Suomi NPP) satellite, NOAA-20, previously known as JPSS-1, NOAA-21, previously known as JPSS-2, and the upcoming JPSS-3 and JPSS-4 satellites. language code: en);
change note: 2023-05-24 13:55:17.0 [sritz] Insert Concept add broader relation (NOAA-21 [a1bc9381-a17a-4028-813a-14e971917a01,1320946] - Joint Polar Satellite System (JPSS) [5c2364ca-c01a-4f69-8808-282c3854b2f6,1310995]);
type: Concept
in scheme: platforms
definition: NOAA’s Joint Polar Satellite System (JPSS) provides global observations that serve as the backbone of both short- and long-term forecasts, including those that help us predict and prepare for severe weather events. The five satellites scheduled in the fleet are the currently-flying NOAA/NASA Suomi National Polar-orbiting Partnership (Suomi NPP) satellite, NOAA-20, previously known as JPSS-1, NOAA-21, previously known as JPSS-2, and the upcoming JPSS-3 and JPSS-4 satellites.

Joint Polar Satellite System (JPSS)
type: Concept