METAMORPHIC ROCK FORMATION
change note: 2013-03-14 14:15:51.0 [tbs1979] insert Definition (id: null text: The formation of metamorphic rock from pressure and heat. language code: en);
change note: 2013-03-05 10:58:52.0 [tbs1979] Insert Concept add broader relation (METAMORPHIC ROCK FORMATION [a243624b-a9c8-4c53-84d1-bb0fe2a71ef6,82979] - METAMORPHIC ROCKS [d220bbb1-410e-4b77-9663-78cb68c6b134,63987]);
in scheme: sciencekeywords
definition: The formation of metamorphic rock from pressure and heat.
type: Concept

METAMORPHIC ROCKS
type: Concept