SOLAR ENERGETIC PARTICLE FLUX
type: Concept

PROTON FLUX
in scheme: sciencekeywords
definition: The rate of flow of protons through a reference surface, measured in particles per unit area.
type: Concept