AU/GA
in scheme: providers
definition: Geoscience Australia is Australia's national agency for geoscience research and geospatial information. It is located within the Industry, Tourism and Resources portfolio. Our research and information contributes to enhanced economic, social and environmental benefits to the community - by providing input for decisions that impact upon resource use, management of the environment, and the safety and well-being of Australians. Each project that Geoscience Australia undertakes has its own project-specific outcome. Projects generate products and services such as research reports, maps, datasets and geoscientific advice to government and other clients Website: "http://www.ga.gov.au/" [Summary provided by Geoscience Australia]
type: Concept

AUSTRALIA
type: Concept