AA
in scheme: projects
definition: ArcAtlas: Our Earth brings to your computer a large collection of maps and information about the earth--its people, plants, animals, and their various environments and economies. Whether you're a researcher needing specific information and analytical tools, a teacher or student exploring the earth and its inhabitants, or just curious, ArcAtlas: Our Earth has something to offer you. ArcAtlas: Our Earth is a unique digital atlas, the result of many years of research by geographers and other earth scientists from Russia and the United States. More than forty different geographic themes were compiled for this atlas, with much of the information developed especially for this project. The collaboration involved the efforts of more than 120 scientists and specialists belonging to a dozen research and other institutions including DATA + (Russia), the Institute of Geography of the Russian Academy of Sciences, M.V. Lomonosov Moscow State University, and ESRI (United States). This summary is from the ESRI home page at http://www.esri.com/data/catalog/esri/esri_aa.html
type: Concept

A - C
type: Concept