ANIMAL COMMODITIES
type: Concept

DAIRY PRODUCTS
in scheme: sciencekeywords
definition: Any measurement related to Dairy commodities/produce, including, but not limited to: milk, cheese, Ice cream, butter, etc... See Animal Commodities.
type: Concept