HRS
in scheme: instruments
definition: [Source: Earth Observation Satellites and Sensors for Risk Management, http://www.space-risks.com/SpaceData/index.php?Satellite_Name=SPOT+5&id_page=8 ] SPOT 5 features a new HRS imaging instrument operating in panchromatic mode. HRS points forward and after of the satellite, giving it the ability to acquire stereopair images almost simultaneously to map relief. Group: Instrument_Details Entry_ID: HRS Group: Instrument_Identification Instrument_Category: Earth Remote Sensing Instruments Instrument_Class: Passive Remote Sensing Instrument_Type: Photon/Optical Detectors Instrument_Subtype: Cameras Short_Name: HRS Long_Name: High Resolution Stereoscopic Instrument End_Group Group: Associated_Platforms Short_Name: SPOT-5 End_Group Group: Spectral_Frequency_Information Wavelength_Keyword: Visible Spectral_Frequency_Coverage_Range: 0.49 μm - 0.69 μm End_Group Online_Resource: http://www.spot.com/ Online_Resource: http://smsc.cnes.fr/SPOT/index.htm Online_Resource: http://www.space-risks.com/SpaceData/index.php?Satellite_Name=SPOT+5&id_page=8 Sample_Image: http://www.space-risks.com/SpaceData/ImaSat/spot5.jpg Creation_Date: 2008-08-25 Group: Instrument_Logistics Instrument_Owner: France/CNES End_Group End_Group
type: Concept

Cameras
type: Concept