OCPS
in scheme: instruments
definition: The Orbiter Camera Payload System (OCPS) includes a Large Format Camera (LFC) that made its maiden voyage aboard the Challenger Shuttle vehicle. The LFC was used to acquire very high resolution images of the Earth's surface. The camera system was operated via ground signal controllers.
type: Concept

Cameras
type: Concept