HYDROSTATIC PRESSURE
in scheme: sciencekeywords
definition: The pressure in a fluid in hydrostatic equilibrium - that is , the downward pressure at a point due solely to the weight of fluid in a column of unit cross-sectional area.
type: Concept

ATMOSPHERIC PRESSURE
type: Concept