UWA/ESS/SPACE
in scheme: providers
definition: Our research group studies the nature of the upper atmosphere and near-Earth space. We are interested in energy coupling between regions and the inputs from the Sun, lightning, and particles to name a few examples. Recent collaborations have involved researchers from the USA, UK, Japan, Canada, Hungary, Canada and Australia, some of which are continuing. New projects are being undertaken researchers from Finland, UK, and the USA. Future projects are planned with collaborators from France and Hungary. Summary Provided By: https://earthweb.ess.washington.edu/space/
type: Concept

ACADEMIC
type: Concept