PROTISTS
type: Concept

PHYTOPLANKTON
type: Concept

PLANKTON
change note: 2017-03-15 11:29:06.0 [mgenazzi] Definition added insert Definition (id: null text: "Plankton refers to any community of floating or weakly swimming organism, mostly microscopic, living in freshwater and saltwater habitats. language code: en);
in scheme: sciencekeywords
definition: "Plankton refers to any community of floating or weakly swimming organism, mostly microscopic, living in freshwater and saltwater habitats.
type: Concept