Imaging Radars
type: Concept

AirSWOT
change note: 2018-05-07 16:38:45.0 [sritz] insert WeightedRelation (id: null related concept uuid: d6aa2406-0323-43c1-b890-3509ee22784e relationship type: null relationship value: null generated by: null); insert WeightedRelation (id: null related concept uuid: 63b6f3d6-3e9a-40c9-ae91-13f580c7b6c3 relationship type: null relationship value: null generated by: null);
change note: 2018-05-07 16:35:47.0 [sritz] Insert Concept add broader relation (AirSWOT [a6a8801e-88f1-42a0-b060-24b38b19a446,367579] - Imaging Radars [824070fa-da29-40fa-ba17-f3d60584bd4d,347803]);
change note: 2018-05-07 16:41:49.0 [sritz] insert Definition (id: null text: AirSWOT is an instrument for supporting the SWOT mission. AirSWOT data help the engineering team better understand the natural properties of the Earth surfaces that SWOT will observe so that the SWOT design can be better tailored to the science objectives of the mission. AirSWOT data will also be used to help calibrate and validate SWOT data and can be used additionally for science studies in their own right. language code: en);
change note: 2021-08-04 17:04:32.0 [sritz] insert AltLabel (id: null category: primary text: Star Tracker language code: en);
change note: 2018-05-07 16:39:38.0 [sritz] update WeightedRelation (Platform-Instrument); update WeightedRelation (1.0); update WeightedRelation (Similar);
change note: 2021-08-04 17:04:55.0 [sritz] update AltLabel (AirSWOT);
change note: 2018-05-07 16:42:21.0 [sritz] update Definition (AirSWOT is an instrument for supporting the SWOT mission. AirSWOT data help the engineering team better understand the natural properties of the Earth surfaces that SWOT will observe so that the SWOT design can be better tailored to the science objectives of the mission. AirSWOT data will also be used to help calibrate and validate SWOT data and can be used additionally for science studies in their own right. More Information: https://swot.jpl.nasa.gov/airswot.htm);
in scheme: instruments
definition: AirSWOT is an instrument for supporting the SWOT mission. AirSWOT data help the engineering team better understand the natural properties of the Earth surfaces that SWOT will observe so that the SWOT design can be better tailored to the science objectives of the mission. AirSWOT data will also be used to help calibrate and validate SWOT data and can be used additionally for science studies in their own right. More Information: https://swot.jpl.nasa.gov/airswot.htm
type: Concept