GAMMA RADIATION DETECTOR
change note: 2021-08-05 11:58:27.0 [sritz] insert AltLabel (id: null category: primary text: GAMMA RADIATION DETECTOR language code: en);
in scheme: instruments
definition: A GAMMA RADIATION DETECTOR is an instrument that is used to discover the highest and strongest form of energy that is radiated or transmitted in the form of rays or waves or particles. Group: Instrument_Details Entry_ID: GAMMA RADIATION DETECTOR Group: Instrument_Identification Instrument_Category: Solar/Space Observing Instruments Instrument_Class: X-Ray/Gamma Ray Detectors Short_Name: GAMMA RADIATION DETECTOR End_Group Online_Resource: http://nssdc.gsfc.nasa.gov/nmc/experimentDisplay.do?id=1976-091A-04 End_Group
type: Concept

X-Ray/Gamma Ray Detectors
type: Concept