NON-GOVERNMENT/NON-PROFIT ORGANIZATIONS
type: Concept

BIFWMS
in scheme: providers
definition: The Society raises funds to research forestry and water issues. The Bowen Island Geolibrary CD contains a comprehensive collection of this information ($10 at the Pharmacy). Ongoing projects include mapping watrcourses, wetlands, and hiking trails.
type: Concept