SPACE SHUTTLES
change note: 2021-11-30 12:26:48.0 [tstevens] Move Concepts delete broader relation (null); add broader relation (SPACE SHUTTLES [a771d41b-2298-47fd-9e5d-f99370540e98,826596] - SPACE SHUTTLE [3ef93fbf-1e19-42a9-a91f-502d125dbb7c,826168]);
change note: 2021-11-30 12:14:31.0 [tstevens] Move Concepts delete broader relation (null); add broader relation (SPACE SHUTTLES [a771d41b-2298-47fd-9e5d-f99370540e98,826596] - Space Stations/Crewed Spacecraft [388e72a1-b851-4b78-9e69-747e06ae215f,826132]);
change note: 2021-11-30 12:08:39.0 [tstevens] Move Concepts delete broader relation (null); add broader relation (SPACE SHUTTLES [a771d41b-2298-47fd-9e5d-f99370540e98,826596] - Space-based Platforms [b39a69b4-c3b9-4a94-b296-bbbbe5e4c847,835875]);
in scheme: platforms
definition: A Space Shuttle is a reusable spacecraft with wings for controlled descent in the atmosphere, designed to transport astronauts between Earth and an orbiting space station and also used to deploy and retrieve satellites. [Source: The American Heritage] Group: Platform_Details Entry_ID: SPACE SHUTTLES Group: Platform_Identification Platform_Category: Space Stations/Manned Spacecraft Platform_Series_or_Entity: SPACE SHUTTLE Short_Name: SPACE SHUTTLES End_Group Creation_Date: 2008-01-25 Online_Resource: http://en.wikipedia.org/wiki/Space_Shuttle Sample_Image: http://www.aerospaceguide.net/spacepictures/shuttle_endeavour.jpg End_Group
type: Concept

Space Shuttle
type: Concept