U-TOKYO/DIAS
change note: 2013-09-12 11:35:01.0 [mpmorahan] insert AltLabel (id: null text: Data Integration Analysis System, University of Tokyo language code: en);
change note: 2013-09-12 11:33:22.0 [mpmorahan] Insert Concept add broader relation (U-TOKYO/DIAS [a8a01648-af5e-40e7-b230-13627180be8c,105839] - ACADEMIC [7700280b-68ee-4644-bf5e-84e7a6adf897,66467]);
in scheme: providers
definition: DIAS is a project for the creation of knowledge which can be shared worldwide.With the goal of providing access to global and regional sensing data,we have developed a pilot system for the creation of an information storage infrastructure for public benefit applications and the deepening of scientific knowledge in the areas of climate, water cycle, for application in fisheries, agriculture and biodiversity managementparticularly through the linking of information across disciplines.This approach has proven to be effective with the successful implementation of our pilot project. Based on this success, DIAS has begun an Environmental information Integration Program to extend and enhance our services.Through this project, stakeholders in various fields can leverage the fusion of large-scale datasets and applicative knowledge.We are proposing the development of a prototype workbench system for information infrastructure,a workbench for leveraging our implemented information infrastructure, allowing users to develop new results based on our accumulated data and expertisefor the solution of global societal dilemmas.Our design strategy is for an operational framework which can provide public benefit in the form of policy-directed data delivery.
type: Concept

ACADEMIC
type: Concept