MRI
change note: 2019-05-06 06:47:35.0 [mmorahan] insert AltLabel (id: null category: primary text: Medium Resolution Imager language code: en); insert Definition (id: null text: Full name Medium Resolution Imager Purpose High-resolution land observation and disasters monitoring Short description 4-channel VIS/NIR camera [see detailed characteristics below] Background Consolidated technology Scanning Technique Pushbroom; swath 300 km Resolution 32 m Coverage / Cycle Global coverage in 10 days language code: en); insert WeightedRelation (id: null related concept uuid: 1dda5116-4079-445e-ae1c-614e49879cf3 relationship type: null relationship value: null generated by: null);
change note: 2019-05-06 06:41:26.0 [mmorahan] Insert Concept add broader relation (MRI [a8cd4c4e-9442-4d08-af4d-af7d544c2d39,368765] - Imaging Spectrometers/Radiometers [944b7691-af37-4fb4-9393-c114e7997829,347979]);
in scheme: instruments
definition: Full name Medium Resolution Imager Purpose High-resolution land observation and disasters monitoring Short description 4-channel VIS/NIR camera [see detailed characteristics below] Background Consolidated technology Scanning Technique Pushbroom; swath 300 km Resolution 32 m Coverage / Cycle Global coverage in 10 days
type: Concept

Imaging Spectrometers/Radiometers
type: Concept