SMEX05
in scheme: projects
definition: Microwave remote sensing provides a direct measurement of soil moisture; however, there have been many challenges in algorithm science and technology that we have faced on the path to providing global measurements. Field experiments, especially those involving both ground and aircraft measurements, provide the linkage between spatial scales necessary for both algorithm development and validation. Soil Moisture Experiments 2005 (SMEX05) was designed to address algorithm development and validation related to several current and scheduled satellite systems that can provide soil moisture. http://www.ars.usda.gov/research/publications/publications.htm?SEQ_NO_115=210810
type: Concept

S - U
type: Concept