A - C
type: Concept

ARK-V/3B
in scheme: projects
definition: The objectives of this project were to map the crustal structure of totally different geological units in a region of close proximity and map the sedimentary distribution and the western boundary of the Mesozoic sediment basin of Jameson Land.
type: Concept