Radio
type: Concept

GRACE-FO MWI
definition: GRACE-FO Microwave Instrument (MWI) consists of a GNSS receiver and a K-band ranging (KBR) assembly.
change note: 2021-06-22 13:36:48.0 [mmorahan] insert AltLabel (id: null category: primary text: GRACE-FO Microwave Instrument language code: en); insert AltLabel (id: null category: null text: Microwave Instrument language code: en); insert Definition (id: null text: GRACE-FO Microwave Instrument (MWI) consists of a GNSS receiver and a K-band ranging (KBR) assembly. language code: en); insert WeightedRelation (id: null related concept uuid: f75e34e2-ebe7-4a6c-8bf6-da596a36b632 relationship type: null relationship value: null generated by: null);
change note: 2021-06-22 13:23:08.0 [mmorahan] Insert Concept add broader relation (GRACE-FO MWI [a915c74a-9f4c-446a-a797-ac732efb8c93,649576] - Radio [7561d126-2baf-4583-a6cc-f8159ebf8e94,641603]);
type: Concept
alternative label: Microwave Instrument
in scheme: instruments