HRTC
in scheme: instruments
definition: High Resolution Technological Camera (HRTC) will improve part of the MMRS scenes. The HRTC will be operational over Argentina during the lifetime of SAC-C. Group: Instrument_Details Entry_ID: HRTC Group: Instrument_Identification Instrument_Category: Earth Remote Sensing Instruments Instrument_Class: Passive Remote Sensing Instrument_Type: Photon/Optical Detectors Instrument_Subtype: Cameras Short_Name: HRTC Long_Name: High Resolution Technological Camera End_Group Group: Associated_Platforms Short_Name: SAC-C End_Group Group: Spectral_Frequency_Information Wavelength_Keyword: Visible Spectral_Frequency_Coverage_Range: 0.40 μm - 0.90 μm End_Group Group: Spectral_Frequency_Information Wavelength_Keyword: Near Infrared Spectral_Frequency_Coverage_Range: 0.40 μm - 0.90 μm End_Group Online_Resource: http://www.conae.gov.ar/sac-c/misionsacc.html#HRTC Creation_Date: 2008-09-11 Group: Instrument_Logistics Instrument_Owner: Argentine Commission on Space Activities (CONAE) End_Group End_Group
type: Concept

Cameras
type: Concept