Current/Wind Meters
type: Concept

Gill WindMaster Pro
type: Concept
definition: The Gill WindMaster Pro is a precision anemometer offering three-axis wind measurement data. This instrument will monitor wind speeds of 0-65m/s and provides sonic temperature, speed of sound and U, V & W vector outputs at 32Hz as standard. The unit also features improved vertical (W) resolution and speed of sound accuracy and less distortion due to wind loading. Each WindMaster Pro can be calibrated with an optional Gill wind tunnel test to provide optimum performance. Optional analogue inputs and outputs plus a PRT are available with 14 bit resolution.
change note: 2023-03-10 16:15:21.0 [sritz] insert AltLabel (id: null category: primary text: Gill WindMaster Pro language code: en);
change note: 2023-03-10 16:17:06.0 [sritz] insert Definition (id: null text: The Gill WindMaster Pro is a precision anemometer offering three-axis wind measurement data. This instrument will monitor wind speeds of 0-65m/s and provides sonic temperature, speed of sound and U, V & W vector outputs at 32Hz as standard. The unit also features improved vertical (W) resolution and speed of sound accuracy and less distortion due to wind loading. Each WindMaster Pro can be calibrated with an optional Gill wind tunnel test to provide optimum performance. Optional analogue inputs and outputs plus a PRT are available with 14 bit resolution. language code: en);
change note: 2023-03-10 16:14:39.0 [sritz] Insert Concept add broader relation (Gill WindMaster Pro [a980b482-34be-4b56-adc9-c3a3fbffefca,1246971] - Current/Wind Meters [1b41692e-c7fe-4567-bed9-b938a7400462,1237925]);
change note: 2023-03-10 16:15:58.0 [sritz] update AltLabel (Gill Instruments WindMaster 3-Axis Ultrasonic Anemometer);
in scheme: instruments