MULTICHANNEL FILTER RADIOMETERS
in scheme: instruments
definition: MULTICHANNEL FILTER RADIOMETERS are instruments that measure radiated electromagnetic power using varied and multiple channeled grooved filters.
type: Concept

Radiometers
type: Concept