IMS-2
change note: 2017-12-27 05:10:54.0 [mmorahan] insert AltLabel (id: null category: primary text: Indian Mini Satellite-2 language code: en); insert Definition (id: null text: IMS-2 Bus is evolved as a standard bus of 400 kg class which includes a payload capability of around 200kg. IMS-2 development is an important milestone as it is envisaged to be a work horse for different types of remote sensing applications. The first mission of IMS-2 is SARAL. SARAL is a co-operative mission between ISRO and CNES with payloads from CNES and spacecraft bus from ISRO. language code: en);
change note: 2017-12-27 05:08:51.0 [mmorahan] Insert Concept add broader relation (IMS-2 [aa137482-53a7-455d-b8d8-52d487380c2a,310491] - IMS [fecf6a37-ffa9-4e11-90cf-1abfeb95cb95,288895]);
in scheme: platforms
definition: IMS-2 Bus is evolved as a standard bus of 400 kg class which includes a payload capability of around 200kg. IMS-2 development is an important milestone as it is envisaged to be a work horse for different types of remote sensing applications. The first mission of IMS-2 is SARAL. SARAL is a co-operative mission between ISRO and CNES with payloads from CNES and spacecraft bus from ISRO.
type: Concept

Indian Mini Satellite (IMS)
type: Concept