NASA/JSC/CEO/ESRS
change note: 2015-06-26 13:56:26.0 [saritz] update AltLabel (Earth Science and Remote Sensing (ESRS), NASA JSC Crew Earth Observations (CEO), Earth Sciences and Image Analysis, Johnson Space Center, NASA); update PrefLabel (NASA/JSC/CEO/ESRS);
in scheme: providers
definition: The Earth Sciences and Image Analysis at NASA's Lyndon B. Johnson Space Center supports the Space Shuttle and International Space Station Programs by training the astronauts in Earth observations communicating with on-orbit astronauts about weather and other Earth processes during missions cataloging and archiving the photographs that astronauts--past, present, and future--take using hand-held cameras. Website: "http://eol.jsc.nasa.gov/" [Summary provided by NASA.]
type: Concept

NASA
type: Concept