Temperature/Humidity Sensors
type: Concept

TEMPERATURE SENSORS
change note: 2021-08-05 17:43:39.0 [sritz] insert AltLabel (id: null category: primary text: TEMPERATURE SENSORS language code: en);
in scheme: instruments
definition: A meteorological sensor used to measure temperature. Group: Instrument_Details Entry_ID: TEMPERATURE SENSORS Group: Instrument_Identification Instrument_Category: In Situ/Laboratory Instruments Instrument_Class: Temperature/Humidity Sensors Short_Name: TEMPERATURE SENSORS End_Group Group: Associated_Platforms Short_Name: SGO End_Group Creation_Date: 2007-07-10 End_Group
type: Concept