CTR
in scheme: providers
definition: The Circum-Pacific Council is joined by American Red Cross, the United States Geological Society and Stanford University to form an international, public-private partnership to address the regional consequences of natural hazards in the Pacific Rim. Nearly two billion people now live within a one day's overland commute to the Pacific Ocean and are vulnerable to the many natural hazards associated with the Rim. In the future, these natural occurring events may well become huge social and economic disasters. Summary Provided By: http://www.circum-pacificcouncil.org/projects/crowding.html
type: Concept

CONSORTIA/INSTITUTIONS
type: Concept