SEA ICE DIRECTION
change note: 2021-10-21 09:32:44.0 [tstevens] insert Definition (id: null text: The direction of ice movement in the ocean. language code: en);
change note: 2021-10-21 09:31:59.0 [tstevens] Insert Concept add broader relation (SEA ICE DIRECTION [ab411758-5abe-4a89-9319-97eba1510cda,778240] - SEA ICE MOTION [a47ab696-7ed9-4374-8965-c8996e61463d,774858]);
in scheme: sciencekeywords
definition: The direction of ice movement in the ocean.
type: Concept

SEA ICE MOTION
type: Concept