VEGETATION
type: Concept

CANOPY CHARACTERISTICS
change note: 2022-09-23 11:06:25.0 [sritz] Insert Concept add narrower relation (CANOPY CHARACTERISTICS [abbba948-9b77-4e19-a855-49a7fbc17696,1052689] - VEGETATION HEIGHT [42eb8baf-edbd-4791-8114-ca898ce5890f,1055465]);
in scheme: sciencekeywords
definition: Canopy characteristics refer to Global Change Master Directory detailed variables under the variable, Canopy Characteristics: canopy height, canopy position, canopy reflectance, canopy resistance, and canopy temperature.
type: Concept

VEGETATION HEIGHT
type: Concept